Reaction Details
TargetAdenosine receptor A2a/A2b
LigandBDBM50406509
Substrate/Competitorn/a
Meas. Tech.ChEMBL_27634 (CHEMBL639510)
EC50 3.7±n/a nM
Citation Ueeda, MThompson, RDArroyo, LHOlsson, RA 2-aralkoxyadenosines: potent and selective agonists at the coronary artery A2 adenosine receptor. J Med Chem34:1340-4 (1991) Adenosine receptor A2a/A2b
Name:Adenosine receptor A2a/A2b
Synonyms:Adenosine A2 receptor
Type:n/a
Mol. Mass.:n/a
Description:ASSAY_ID of ChEMBL is 329906
Components:This complex has 2 components.
Component 1
Name:Adenosine receptor A2b
Type:G Protein-Coupled Receptor (GPCR)
Mol. Mass.:36341.22
Organism:Homo sapiens (Human)
Description:n/a
Residue:332
Component 2
Name:Adenosine receptor A2a
Synonyms:A2A adenosine receptor (hA2A) ADENOSINE A2 ADORA2 Adenosine A2A receptor (A2AAR)
Type:G Protein-Coupled Receptor (GPCR)
Mol. Mass.:44716.46
Organism:Homo sapiens (Human)
Description:P29274
Residue:412
BDBM50406509
NameBDBM50406509
Synonyms:CHEMBL605667
TypeSmall organic molecule
Emp. Form.C16H19N5O5S
Mol. Mass.393.418
SMILESNc1nc(OCCc2cccs2)nc2n(cnc12)C1O[C@@H](CO)[C@H](O)[C@@H]1O