Reaction Details
TargetAngiotensin-converting enzyme
LigandBDBM21642
Substrate/Competitorn/a
Meas. Tech.ChEMBL_36150 (CHEMBL648337)
IC50 22.9±n/a nM
Citation Waller, CLMarshall, GR Three-dimensional quantitative structure-activity relationship of angiotesin-converting enzyme and thermolysin inhibitors. II. A comparison of CoMFA models incorporating molecular orbital fields and desolvation free energies based on active-analog and complementary-receptor-field alignment rules. J Med Chem36:2390-403 (1993) Angiotensin-converting enzyme
Name:Angiotensin-converting enzyme
Type:Enzyme
Mol. Mass.:149709.01
Organism:Homo sapiens (Human)
Description:n/a
Residue:1306
BDBM21642
NameBDBM21642
Synonyms:(2S)-1-[(2S)-2-methyl-3-sulfanylpropanoyl]pyrrolidine-2-carboxylic acid Capozide Lopirin SQ14534 | US11491146, Compound L-Captopril
TypeSmall organic molecule
Emp. Form.C9H15NO3S
Mol. Mass.217.285
SMILESC[C@H](CS)C(=O)N1CCC[C@H]1C(O)=O