Reaction Details
TargetAngiotensin-converting enzyme
LigandBDBM50406908
Substrate/Competitorn/a
Meas. Tech.ChEBML_36150
IC50 0.251189±n/a nM
Citation Waller, CLMarshall, GR Three-dimensional quantitative structure-activity relationship of angiotesin-converting enzyme and thermolysin inhibitors. II. A comparison of CoMFA models incorporating molecular orbital fields and desolvation free energies based on active-analog and complementary-receptor-field alignment rules. J Med Chem36:2390-403 (1993) Angiotensin-converting enzyme
Name:Angiotensin-converting enzyme
Type:Enzyme
Mol. Mass.:149709.01
Organism:Homo sapiens (Human)
Description:n/a
Residue:1306
BDBM50406908
NameBDBM50406908
Synonyms:CHEMBL78629
TypeSmall organic molecule
Emp. Form.C31H31N3O8
Mol. Mass.573.5931
SMILESOC(=O)[C@@H](CCC(=O)N1[C@@H](Cc2ccccc12)C(O)=O)NC(=O)C(Cc1ccccc1)NC(=O)OCc1ccccc1