Reaction Details
TargetAngiotensin-converting enzyme
LigandBDBM50406375
Substrate/Competitorn/a
Meas. Tech.ChEBML_36150
IC50 0.288403±n/a nM
Citation Waller, CLMarshall, GR Three-dimensional quantitative structure-activity relationship of angiotesin-converting enzyme and thermolysin inhibitors. II. A comparison of CoMFA models incorporating molecular orbital fields and desolvation free energies based on active-analog and complementary-receptor-field alignment rules. J Med Chem36:2390-403 (1993) Angiotensin-converting enzyme
Name:Angiotensin-converting enzyme
Type:Enzyme
Mol. Mass.:149709.01
Organism:Homo sapiens (Human)
Description:n/a
Residue:1306
BDBM50406375
NameBDBM50406375
Synonyms:CHEMBL35682
TypeSmall organic molecule
Emp. Form.C26H37N2O8P
Mol. Mass.536.5543
SMILESCOc1ccc(cc1OC)N(CC(O)=O)C(=O)[C@H](CCCCN)OP(O)(=O)CCCCc1ccccc1