Reaction Details
TargetAngiotensin-converting enzyme
LigandBDBM50406378
Substrate/Competitorn/a
Meas. Tech.ChEBML_36150
IC50 0.776247±n/a nM
Citation Waller, CLMarshall, GR Three-dimensional quantitative structure-activity relationship of angiotesin-converting enzyme and thermolysin inhibitors. II. A comparison of CoMFA models incorporating molecular orbital fields and desolvation free energies based on active-analog and complementary-receptor-field alignment rules. J Med Chem36:2390-403 (1993) Angiotensin-converting enzyme
Name:Angiotensin-converting enzyme
Type:Enzyme
Mol. Mass.:149709.01
Organism:Homo sapiens (Human)
Description:n/a
Residue:1306
BDBM50406378
NameBDBM50406378
Synonyms:CHEMBL431707
TypeSmall organic molecule
Emp. Form.C27H37N2O6PS
Mol. Mass.548.631
SMILESNCCCC[C@H](OP(O)(=O)CCCCc1ccccc1)C(=O)N1C[C@@H](C[C@H]1C(O)=O)Sc1ccccc1