Reaction Details
TargetGag-Pol polyprotein [489-587]
LigandBDBM50005701
Substrate/Competitorn/a
Meas. Tech.ChEMBL_158033 (CHEMBL768257)
IC50 1.1±n/a nM
Citation Waller, CLOprea, TIGiolitti, AMarshall, GR Three-dimensional QSAR of human immunodeficiency virus (I) protease inhibitors. 1. A CoMFA study employing experimentally-determined alignment rules. J Med Chem36:4152-60 (1994) Gag-Pol polyprotein [489-587]
Name:Gag-Pol polyprotein [489-587]
Type:Enzyme Subunit
Mol. Mass.:10781.16
Organism:Human immunodeficiency virus type 1
Description:P04585[489-587]
Residue:99
BDBM50005701
NameBDBM50005701
Synonyms:CHEMBL337283 | N*1*-[1-Benzyl-3-(2-tert-butylcarbamoyl-pyrrolidin-1-yl)-2-hydroxy-3-oxo-propyl]-2-[(quinoline-2-carbonyl)-amino]-succinamide
TypeSmall organic molecule
Emp. Form.C33H40N6O6
Mol. Mass.616.7073
SMILESCC(C)(C)NC(=O)[C@@H]1CCCN1C(=O)[C@@H](O)[C@H](Cc1ccccc1)NC(=O)[C@H](CC(N)=O)NC(=O)c1ccc2ccccc2n1