Reaction Details
TargetReverse transcriptase/RNaseH
LigandBDBM2248
Substrate/Competitorn/a
Meas. Tech.ChEMBL_195671 (CHEMBL800744)
IC50 30±n/a nM
Citation Hoffman, JMSmith, AMRooney, CSFisher, TEWai, JSThomas, CMBamberger, DLBarnes, JLWilliams, TMJones, JH Synthesis and evaluation of 2-pyridinone derivatives as HIV-1-specific reverse transcriptase inhibitors. 4. 3-[2-(Benzoxazol-2-yl)ethyl]-5-ethyl-6-methylpyridin-2(1H)-one and analogues. J Med Chem36:953-66 (1993) Reverse transcriptase/RNaseH
Name:Reverse transcriptase/RNaseH
Type:PROTEIN
Mol. Mass.:65229.15
Organism:Human immunodeficiency virus 1
Description:ChEMBL_1473730
Residue:566
BDBM2248
NameBDBM2248
Synonyms:2-Pyridinone derivative 28 3-[2-(4,7-dichloro-1,3-benzoxazol-2-yl)ethyl]-5-ethyl-6-methyl-1,2-dihydropyridine-2-thione | CHEMBL172311
TypeSmall organic molecule
Emp. Form.C17H16Cl2N2OS
Mol. Mass.367.293
SMILESCCc1cc(CCc2nc3c(Cl)ccc(Cl)c3o2)c(=S)[nH]c1C