Reaction Details
TargetVasopressin V2 receptor
LigandBDBM50407343
Substrate/Competitorn/a
Meas. Tech.ChEMBL_215023 (CHEMBL856234)
Kd>501±n/a nM
Citation Manning, MCheng, LLKlis, WABalaspiri, LOlma, ASawyer, WHWo, NCChan, WY Effects of a D-Cys6/L-Cys6 interchange in nonselective and selective vasopressin and oxytocin antagonists. J Med Chem38:1762-9 (1995) Vasopressin V2 receptor
Name:Vasopressin V2 receptor
Type:G-protein coupled receptor
Mol. Mass.:40761.85
Organism:Rattus norvegicus (Rat)
Description:n/a
Residue:371
BDBM50407343
NameBDBM50407343
Synonyms:CHEMBL412806
TypeSmall organic molecule
Emp. Form.C50H75N15O11S2
Mol. Mass.1126.354
SMILESCC[C@H](C)[C@H]1NC(=O)[C@H](Cc2cc3ccccc3[nH]2)NC(=O)CC2(CCCCC2)SSC[C@@H](NC(=O)[C@@H](CC(N)=O)NC(=O)[C@H](CCC(N)=O)NC1=O)C(=O)N1CCC[C@H]1C(=O)N[C@@H](CCCNC(N)=N)C(=O)NCC(N)=O