Reaction Details
Target5-hydroxytryptamine receptor 2C
LigandBDBM50407356
Substrate/Competitorn/a
Meas. Tech.ChEMBL_2793 (CHEMBL617862)
IC50 501.19±n/a nM
Citation Street, LJBaker, RDavey, WBGuiblin, ARJelley, RAReeve, AJRoutledge, HSternfeld, FWatt, APBeer, MS Synthesis and serotonergic activity of N,N-dimethyl-2-[5-(1,2,4-triazol-1-ylmethyl)-1H-indol-3-yl]ethylamine and analogues: potent agonists for 5-HT1D receptors. J Med Chem38:1799-810 (1995) 5-hydroxytryptamine receptor 2C
Name:5-hydroxytryptamine receptor 2C
Type:G Protein-Coupled Receptor (GPCR)
Mol. Mass.:51836.79
Organism:Homo sapiens (Human)
Description:P28335
Residue:458
BDBM50407356
NameBDBM50407356
Synonyms:CHEMBL54265
TypeSmall organic molecule
Emp. Form.C14H17N5
Mol. Mass.255.3183
SMILESCN(C)CCc1c[nH]c2ccc(cc12)-n1cncn1