Reaction Details
TargetDopamine beta-hydroxylase
LigandBDBM50014978
Substrate/Competitorn/a
Meas. Tech.ChEMBL_59302 (CHEMBL669437)
IC50 74.13±n/a nM
Citation Hahn, MRogers, D Receptor surface models. 2. Application to quantitative structure-activity relationships studies. J Med Chem38:2091-102 (1995) Dopamine beta-hydroxylase
Name:Dopamine beta-hydroxylase
Type:PROTEIN
Mol. Mass.:69062.68
Organism:Homo sapiens (Human)
Description:ChEMBL_59428
Residue:617
BDBM50014978
NameBDBM50014978
Synonyms:1-(3,5-Difluoro-4-hydroxy-benzyl)-1,3-dihydro-imidazole-2-thione | CHEMBL433493
TypeSmall organic molecule
Emp. Form.C10H8F2N2OS
Mol. Mass.242.245
SMILESOc1c(F)cc(Cn2cc[nH]c2=S)cc1F