Reaction Details
TargetAngiotensin-converting enzyme
LigandBDBM50169138
Substrate/Competitorn/a
Meas. Tech.ChEMBL_36008 (CHEMBL858254)
IC50 380189.4±n/a nM
Citation Collantes, ERDunn, WJ Amino acid side chain descriptors for quantitative structure-activity relationship studies of peptide analogues. J Med Chem38:2705-13 (1995) Angiotensin-converting enzyme
Name:Angiotensin-converting enzyme
Type:Enzyme
Mol. Mass.:149709.01
Organism:Homo sapiens (Human)
Description:n/a
Residue:1306
BDBM50169138
NameBDBM50169138
Synonyms:(S)-2-((S)-2,6-Diamino-hexanoylamino)-propionic acid | CHEMBL93178
TypeSmall organic molecule
Emp. Form.C9H19N3O3
Mol. Mass.217.2655
SMILESC[C@H](NC(=O)[C@@H](N)CCCCN)C(O)=O