Reaction Details
TargetAngiotensin-converting enzyme
LigandBDBM50407459
Substrate/Competitorn/a
Meas. Tech.ChEMBL_36008 (CHEMBL858254)
IC50 1412537.54±n/a nM
Citation Collantes, ERDunn, WJ Amino acid side chain descriptors for quantitative structure-activity relationship studies of peptide analogues. J Med Chem38:2705-13 (1995) Angiotensin-converting enzyme
Name:Angiotensin-converting enzyme
Type:Enzyme
Mol. Mass.:149709.01
Organism:Homo sapiens (Human)
Description:n/a
Residue:1306
BDBM50407459
NameBDBM50407459
Synonyms:CHEMBL330552
TypeSmall organic molecule
Emp. Form.C7H14N2O3S
Mol. Mass.206.263
SMILESCSCC[C@H](NC(=O)CN)C(O)=O