Reaction Details
TargetDihydrofolate reductase
LigandBDBM50291766
Substrate/Competitorn/a
Meas. Tech.ChEMBL_53000 (CHEMBL858265)
Ki 4.79±n/a nM
Citation Marlowe, CKSelassie, CDSanti, DV Quantitative structure-activity relationships of the inhibition of Pneumocystis carinii dihydrofolate reductase by 4,6-diamino-1,2-dihydro-2,2-dimethyl-1-(X-phenyl)-s-triazines. J Med Chem38:967-72 (1995) Dihydrofolate reductase
Name:Dihydrofolate reductase
Type:Enzyme
Mol. Mass.:23891.29
Organism:Pneumocystis carinii
Description:n/a
Residue:206
BDBM50291766
NameBDBM50291766
Synonyms:1-[3-(3-Isopropyl-phenoxymethyl)-phenyl]-6,6-dimethyl-1,6-dihydro-[1,3,5]triazine-2,4-diamine | CHEMBL20227
TypeSmall organic molecule
Emp. Form.C21H27N5O
Mol. Mass.365.472
SMILESCC(C)c1cccc(OCc2cccc(c2)N2C(N)=NC(N)=NC2(C)C)c1