Reaction Details
TargetDihydrofolate reductase
LigandBDBM50291794
Substrate/Competitorn/a
Meas. Tech.ChEMBL_53000 (CHEMBL858265)
Ki 5.37±n/a nM
Citation Marlowe, CKSelassie, CDSanti, DV Quantitative structure-activity relationships of the inhibition of Pneumocystis carinii dihydrofolate reductase by 4,6-diamino-1,2-dihydro-2,2-dimethyl-1-(X-phenyl)-s-triazines. J Med Chem38:967-72 (1995) Dihydrofolate reductase
Name:Dihydrofolate reductase
Type:Enzyme
Mol. Mass.:23891.29
Organism:Pneumocystis carinii
Description:n/a
Residue:206
BDBM50291794
NameBDBM50291794
Synonyms:6,6-Dimethyl-1-(3-phenylsulfanylmethyl-phenyl)-1,6-dihydro-[1,3,5]triazine-2,4-diamine | CHEMBL21031
TypeSmall organic molecule
Emp. Form.C18H21N5S
Mol. Mass.339.458
SMILESCC1(C)N=C(N)N=C(N)N1c1cccc(CSc2ccccc2)c1