Reaction Details
TargetDihydrofolate reductase
LigandBDBM50291784
Substrate/Competitorn/a
Meas. Tech.ChEMBL_53000 (CHEMBL858265)
Ki 6.76±n/a nM
Citation Marlowe, CKSelassie, CDSanti, DV Quantitative structure-activity relationships of the inhibition of Pneumocystis carinii dihydrofolate reductase by 4,6-diamino-1,2-dihydro-2,2-dimethyl-1-(X-phenyl)-s-triazines. J Med Chem38:967-72 (1995) Dihydrofolate reductase
Name:Dihydrofolate reductase
Type:Enzyme
Mol. Mass.:23891.29
Organism:Pneumocystis carinii
Description:n/a
Residue:206
BDBM50291784
NameBDBM50291784
Synonyms:6,6-Dimethyl-1-(3-nonyloxy-phenyl)-1,6-dihydro-[1,3,5]triazine-2,4-diamine | CHEMBL20129
TypeSmall organic molecule
Emp. Form.C20H33N5O
Mol. Mass.359.5089
SMILESCCCCCCCCCOc1cccc(c1)N1C(N)=NC(N)=NC1(C)C