Reaction Details
TargetDihydrofolate reductase
LigandBDBM50291805
Substrate/Competitorn/a
Meas. Tech.ChEMBL_53000 (CHEMBL858265)
Ki 5.75±n/a nM
Citation Marlowe, CKSelassie, CDSanti, DV Quantitative structure-activity relationships of the inhibition of Pneumocystis carinii dihydrofolate reductase by 4,6-diamino-1,2-dihydro-2,2-dimethyl-1-(X-phenyl)-s-triazines. J Med Chem38:967-72 (1995) Dihydrofolate reductase
Name:Dihydrofolate reductase
Type:Enzyme
Mol. Mass.:23891.29
Organism:Pneumocystis carinii
Description:n/a
Residue:206
BDBM50291805
NameBDBM50291805
Synonyms:6,6-Dimethyl-1-{3-[4-(3-trifluoromethyl-phenoxy)-butoxy]-phenyl}-1,6-dihydro-[1,3,5]triazine-2,4-diamine | CHEMBL6671
TypeSmall organic molecule
Emp. Form.C22H26F3N5O2
Mol. Mass.449.4693
SMILESCC1(C)N=C(N)N=C(N)N1c1cccc(OCCCCOc2cccc(c2)C(F)(F)F)c1