Reaction Details
TargetDihydrofolate reductase
LigandBDBM50407731
Substrate/Competitorn/a
Meas. Tech.ChEMBL_53000 (CHEMBL858265)
Ki 6.31±n/a nM
Citation Marlowe, CKSelassie, CDSanti, DV Quantitative structure-activity relationships of the inhibition of Pneumocystis carinii dihydrofolate reductase by 4,6-diamino-1,2-dihydro-2,2-dimethyl-1-(X-phenyl)-s-triazines. J Med Chem38:967-72 (1995) Dihydrofolate reductase
Name:Dihydrofolate reductase
Type:Enzyme
Mol. Mass.:23891.29
Organism:Pneumocystis carinii
Description:n/a
Residue:206
BDBM50407731
NameBDBM50407731
Synonyms:CHEMBL174559
TypeSmall organic molecule
Emp. Form.C18H29N5
Mol. Mass.315.4564
SMILESCCCCCCCc1ccc(cc1)N1C(N)=NC(N)=NC1(C)C