Reaction Details
TargetAcetylcholinesterase
LigandBDBM9408
Substrate/Competitorn/a
Meas. Tech.ChEMBL_28928 (CHEMBL857056)
IC50 34.99±n/a nM
Citation Tong, WCollantes, ERChen, YWelsh, WJ A comparative molecular field analysis study of N-benzylpiperidines as acetylcholinesterase inhibitors. J Med Chem39:380-7 (1996) 
 
Acetylcholinesterase
Name:Acetylcholinesterase
Type:Enzyme
Mol. Mass.:68165.65
Organism:Mus musculus (mouse)
Description:n/a
Residue:614
BDBM9408
NameBDBM9408
Synonyms:(2E)-but-2-enedioic acid; N-[2-(1-benzylpiperidin-4-yl)ethyl]-N-phenylbenzamide CHEMBL55312 N-[2-(1-benzylpiperidin-4-yl)ethyl]-N-phenylbenzamide Fumarate | Piperidine Derivative 20
TypeSmall organic molecule
Emp. Form.C27H30N2O
Mol. Mass.398.5399
SMILESO=C(N(CCC1CCN(Cc2ccccc2)CC1)c1ccccc1)c1ccccc1