Reaction Details
TargetAcetylcholinesterase
LigandBDBM9400
Substrate/Competitorn/a
Meas. Tech.ChEMBL_28928 (CHEMBL857056)
IC50 38.99±n/a nM
Citation Tong, WCollantes, ERChen, YWelsh, WJ A comparative molecular field analysis study of N-benzylpiperidines as acetylcholinesterase inhibitors. J Med Chem39:380-7 (1996) 
 
Acetylcholinesterase
Name:Acetylcholinesterase
Type:Enzyme
Mol. Mass.:68165.65
Organism:Mus musculus (mouse)
Description:n/a
Residue:614
BDBM9400
NameBDBM9400
Synonyms:(2E)-but-2-enedioic acid; N-[2-(1-benzylpiperidin-4-yl)ethyl]pyridine-4-carboxamide Piperidine Derivative 3p
TypeSmall organic molecule
Emp. Form.C20H25N3O
Mol. Mass.323.432
SMILESO=C(NCCC1CCN(Cc2ccccc2)CC1)c1ccncc1