Reaction Details
TargetAcetylcholinesterase
LigandBDBM50039718
Substrate/Competitorn/a
Meas. Tech.ChEMBL_28756 (CHEMBL641020)
IC50 100±n/a nM
Citation Tong, WCollantes, ERChen, YWelsh, WJ A comparative molecular field analysis study of N-benzylpiperidines as acetylcholinesterase inhibitors. J Med Chem39:380-7 (1996) 
 
Acetylcholinesterase
Name:Acetylcholinesterase
Type:Enzyme
Mol. Mass.:67792.70
Organism:Homo sapiens (Human)
Description:P22303
Residue:614
BDBM50039718
NameBDBM50039718
Synonyms:3-(2-(1-benzylpiperidin-4-yl)ethyl)benzo[d]isoxazole-6-carbonitrile CHEMBL92775
TypeSmall organic molecule
Emp. Form.C22H23N3O
Mol. Mass.345.4375
SMILESN#Cc1ccc2c(CCC3CCN(Cc4ccccc4)CC3)noc2c1