Reaction Details
TargetB2 bradykinin receptor
LigandBDBM50408044
Substrate/Competitorn/a
Meas. Tech.ChEMBL_40445 (CHEMBL652384)
Kd 173.78±n/a nM
Citation Goodfellow, VSMarathe, MVKuhlman, KGFitzpatrick, TDCuadrado, DHanson, WZuzack, JSRoss, SEWieczorek, MBurkard, MWhalley, ET Bradykinin receptor antagonists containing N-substituted amino acids: in vitro and in vivo B(2) and B(1) receptor antagonist activity. J Med Chem39:1472-84 (1996) 
 
B2 bradykinin receptor
Name:B2 bradykinin receptor
Type:Enzyme Catalytic Domain
Mol. Mass.:44941.22
Organism:RAT
Description:B2 BRADYKININ BDKRB2 RAT::P25023
Residue:396
BDBM50408044
NameBDBM50408044
Synonyms:CHEMBL3038104
TypeSmall organic molecule
Emp. Form.C52H79N15O12S
Mol. Mass.1138.342
SMILES[#7]-[#6](-[#7])-[#7]-[#6]-[#6]-[#6]-[#6@H](-[#7]-[#6](=O)-[#6@H](-[#7])-[#6]-[#6]-[#6]\[#7]=[#6](\[#7])-[#7])-[#6](=O)-[#7]-1-[#6]-[#6]-[#6]-[#6@H]-1-[#6](=O)-[#7]-1-[#6]-[#6@H](-[#8])-[#6]-[#6@H]-1-[#6](=O)-[#7]-[#6]-[#6](=O)-[#7]-[#6@@H](-[#6]-c1cccs1)-[#6](=O)-[#7]-[#6@@H](-[#6]-[#8])-[#6](=O)-[#7]-1-[#6]-c2ccccc2-[#6]-[#6@@H]-1-[#6](=O)-[#7](-[#6]-[#6](-[#8])=O)-[#6]-1-[#6]-[#6]-[#6]-[#6]-[#6]-1