Reaction Details
TargetB2 bradykinin receptor
LigandBDBM50408045
Substrate/Competitorn/a
Meas. Tech.ChEMBL_40445 (CHEMBL652384)
Kd 0.49±n/a nM
Citation Goodfellow, VSMarathe, MVKuhlman, KGFitzpatrick, TDCuadrado, DHanson, WZuzack, JSRoss, SEWieczorek, MBurkard, MWhalley, ET Bradykinin receptor antagonists containing N-substituted amino acids: in vitro and in vivo B(2) and B(1) receptor antagonist activity. J Med Chem39:1472-84 (1996) 
 
B2 bradykinin receptor
Name:B2 bradykinin receptor
Type:Enzyme Catalytic Domain
Mol. Mass.:44941.22
Organism:RAT
Description:B2 BRADYKININ BDKRB2 RAT::P25023
Residue:396
BDBM50408045
NameBDBM50408045
Synonyms:CHEMBL2372278
TypeSmall organic molecule
Emp. Form.C52H76N14O12S
Mol. Mass.1121.311
SMILESNC(=N)NCCCCC(=O)N1CCC[C@@H]1C(=O)N1C[C@@H](O)C[C@@H]1C(=O)NCC(=O)N[C@@H](Cc1cccs1)C(=O)N[C@@H](CO)C(=O)N1Cc2ccccc2C[C@@H]1C(=O)N(CC(=O)N[C@@H](CCCNC(N)=N)C(O)=O)C1CCCCC1