Reaction Details
TargetAryl hydrocarbon receptor
LigandBDBM50408308
Substrate/Competitorn/a
Meas. Tech.ChEMBL_36196 (CHEMBL649365)
EC50 41.02±n/a nM
Citation So, SSKarplus, M Three-dimensional quantitative structure-activity relationships from molecular similarity matrices and genetic neural networks. 2. Applications. J Med Chem40:4360-71 (1998) 
 
Aryl hydrocarbon receptor
Name:Aryl hydrocarbon receptor
Type:PROTEIN
Mol. Mass.:96143.77
Organism:Homo sapiens (Human)
Description:ChEMBL_1503828
Residue:848
BDBM50408308
NameBDBM50408308
Synonyms:CHEMBL136710
TypeSmall organic molecule
Emp. Form.C12H4Cl4O
Mol. Mass.305.972
SMILESClc1cc2oc3cc(Cl)c(Cl)cc3c2cc1Cl