Reaction Details
TargetAryl hydrocarbon receptor
LigandBDBM50408314
Substrate/Competitorn/a
Meas. Tech.ChEMBL_36196 (CHEMBL649365)
EC50 70.96±n/a nM
Citation So, SSKarplus, M Three-dimensional quantitative structure-activity relationships from molecular similarity matrices and genetic neural networks. 2. Applications. J Med Chem40:4360-71 (1998) 
 
Aryl hydrocarbon receptor
Name:Aryl hydrocarbon receptor
Type:PROTEIN
Mol. Mass.:96143.77
Organism:Homo sapiens (Human)
Description:ChEMBL_1503828
Residue:848
BDBM50408314
NameBDBM50408314
Synonyms:CHEMBL136335
TypeSmall organic molecule
Emp. Form.C12H5Cl3O2
Mol. Mass.287.526
SMILESClc1ccc2Oc3cc(Cl)c(Cl)cc3Oc2c1