Reaction Details
TargetAryl hydrocarbon receptor
LigandBDBM50408322
Substrate/Competitorn/a
Meas. Tech.ChEMBL_36196 (CHEMBL649365)
EC50 92.9±n/a nM
Citation So, SSKarplus, M Three-dimensional quantitative structure-activity relationships from molecular similarity matrices and genetic neural networks. 2. Applications. J Med Chem40:4360-71 (1998) 
 
Aryl hydrocarbon receptor
Name:Aryl hydrocarbon receptor
Type:PROTEIN
Mol. Mass.:96143.77
Organism:Homo sapiens (Human)
Description:ChEMBL_1503828
Residue:848
BDBM50408322
NameBDBM50408322
Synonyms:CHEMBL135026
TypeSmall organic molecule
Emp. Form.C12H4Br4O2
Mol. Mass.499.775
SMILESBrc1cc(Br)c2Oc3c(Br)cc(Br)cc3Oc2c1