Reaction Details
TargetAryl hydrocarbon receptor
LigandBDBM23927
Substrate/Competitorn/a
Meas. Tech.ChEMBL_36196 (CHEMBL649365)
EC50 10±n/a nM
Citation So, SSKarplus, M Three-dimensional quantitative structure-activity relationships from molecular similarity matrices and genetic neural networks. 2. Applications. J Med Chem40:4360-71 (1998) 
 
Aryl hydrocarbon receptor
Name:Aryl hydrocarbon receptor
Type:PROTEIN
Mol. Mass.:96143.77
Organism:Homo sapiens (Human)
Description:ChEMBL_1503828
Residue:848
BDBM23927
NameBDBM23927
Synonyms:2,3,7,8-Tetrachlorodibenzo-p-dioxin Tetrachlorodibenzodioxin | [3H]-TCDD
Typeradiolabeled ligand
Emp. Form.C12H4Cl4O2
Mol. Mass.321.971
SMILESClc1cc2Oc3cc(Cl)c(Cl)cc3Oc2cc1Cl