Reaction Details
TargetAryl hydrocarbon receptor
LigandBDBM50408334
Substrate/Competitorn/a
Meas. Tech.ChEMBL_36196 (CHEMBL649365)
EC50 15.49±n/a nM
Citation So, SSKarplus, M Three-dimensional quantitative structure-activity relationships from molecular similarity matrices and genetic neural networks. 2. Applications. J Med Chem40:4360-71 (1998) 
 
Aryl hydrocarbon receptor
Name:Aryl hydrocarbon receptor
Type:PROTEIN
Mol. Mass.:96143.77
Organism:Homo sapiens (Human)
Description:ChEMBL_1503828
Residue:848
BDBM50408334
NameBDBM50408334
Synonyms:CHEMBL135555
TypeSmall organic molecule
Emp. Form.C12H6Br2O2
Mol. Mass.341.983
SMILESBrc1ccc2Oc3cc(Br)ccc3Oc2c1