Reaction Details
TargetAryl hydrocarbon receptor
LigandBDBM50408340
Substrate/Competitorn/a
Meas. Tech.ChEMBL_36196 (CHEMBL649365)
EC50 67.76±n/a nM
Citation So, SSKarplus, M Three-dimensional quantitative structure-activity relationships from molecular similarity matrices and genetic neural networks. 2. Applications. J Med Chem40:4360-71 (1998) 
 
Aryl hydrocarbon receptor
Name:Aryl hydrocarbon receptor
Type:PROTEIN
Mol. Mass.:96143.77
Organism:Homo sapiens (Human)
Description:ChEMBL_1503828
Residue:848
BDBM50408340
NameBDBM50408340
Synonyms:CHEMBL136782
TypeSmall organic molecule
Emp. Form.C12H3Cl5O
Mol. Mass.340.417
SMILESClc1ccc2c(oc3c(Cl)cc(Cl)c(Cl)c23)c1Cl