Reaction Details
TargetAryl hydrocarbon receptor
LigandBDBM50408353
Substrate/Competitorn/a
Meas. Tech.ChEMBL_36196 (CHEMBL649365)
EC50 11.51±n/a nM
Citation So, SSKarplus, M Three-dimensional quantitative structure-activity relationships from molecular similarity matrices and genetic neural networks. 2. Applications. J Med Chem40:4360-71 (1998) 
 
Aryl hydrocarbon receptor
Name:Aryl hydrocarbon receptor
Type:PROTEIN
Mol. Mass.:96143.77
Organism:Homo sapiens (Human)
Description:ChEMBL_1503828
Residue:848
BDBM50408353
NameBDBM50408353
Synonyms:CHEMBL138223
TypeSmall organic molecule
Emp. Form.C12H4BrCl3O2
Mol. Mass.366.422
SMILESClc1cc2Oc3cc(Cl)c(Br)cc3Oc2cc1Cl