Reaction Details
TargetAryl hydrocarbon receptor
LigandBDBM50408359
Substrate/Competitorn/a
Meas. Tech.ChEMBL_36196 (CHEMBL649365)
EC50 2±n/a nM
Citation So, SSKarplus, M Three-dimensional quantitative structure-activity relationships from molecular similarity matrices and genetic neural networks. 2. Applications. J Med Chem40:4360-71 (1998) 
 
Aryl hydrocarbon receptor
Name:Aryl hydrocarbon receptor
Type:PROTEIN
Mol. Mass.:96143.77
Organism:Homo sapiens (Human)
Description:ChEMBL_1503828
Residue:848
BDBM50408359
NameBDBM50408359
Synonyms:CHEMBL137055
TypeSmall organic molecule
Emp. Form.C12H4Br4O2
Mol. Mass.499.775
SMILESBrc1cc(Br)c2Oc3cc(Br)c(Br)cc3Oc2c1