Reaction Details
TargetAryl hydrocarbon receptor
LigandBDBM50408363
Substrate/Competitorn/a
Meas. Tech.ChEMBL_36196 (CHEMBL649365)
EC50 79.43±n/a nM
Citation So, SSKarplus, M Three-dimensional quantitative structure-activity relationships from molecular similarity matrices and genetic neural networks. 2. Applications. J Med Chem40:4360-71 (1998) 
 
Aryl hydrocarbon receptor
Name:Aryl hydrocarbon receptor
Type:PROTEIN
Mol. Mass.:96143.77
Organism:Homo sapiens (Human)
Description:ChEMBL_1503828
Residue:848
BDBM50408363
NameBDBM50408363
Synonyms:CHEMBL137220
TypeSmall organic molecule
Emp. Form.C12H3Cl5O2
Mol. Mass.356.416
SMILESClc1cc2Oc3cc(Cl)c(Cl)c(Cl)c3Oc2cc1Cl