Reaction Details
TargetD(3) dopamine receptor
LigandBDBM50408394
Substrate/Competitorn/a
Meas. Tech.ChEMBL_62439 (CHEMBL858764)
Ki 1000±n/a nM
Citation Nilsson, JWikström, HSmilde, AGlase, SPugsley, TCruciani, GPastor, MClementi, S GRID/GOLPE 3D quantitative structure-activity relationship study on a set of benzamides and naphthamides, with affinity for the dopamine D3 receptor subtype. J Med Chem40:833-40 (1997) 
 
D(3) dopamine receptor
Name:D(3) dopamine receptor
Type:n/a
Mol. Mass.:44243.43
Organism:Homo sapiens (Human)
Description:n/a
Residue:400
BDBM50408394
NameBDBM50408394
Synonyms:CHEMBL352905
TypeSmall organic molecule
Emp. Form.C20H23Cl2N3O3
Mol. Mass.424.321
SMILESCOc1c(Cl)cc(Cl)c(O)c1C(=O)NCCN1CCN(CC1)c1ccccc1