Reaction Details
TargetD(3) dopamine receptor
LigandBDBM50408403
Substrate/Competitorn/a
Meas. Tech.ChEMBL_62439 (CHEMBL858764)
Ki 125.89±n/a nM
Citation Nilsson, JWikström, HSmilde, AGlase, SPugsley, TCruciani, GPastor, MClementi, S GRID/GOLPE 3D quantitative structure-activity relationship study on a set of benzamides and naphthamides, with affinity for the dopamine D3 receptor subtype. J Med Chem40:833-40 (1997) 
 
D(3) dopamine receptor
Name:D(3) dopamine receptor
Type:n/a
Mol. Mass.:44243.43
Organism:Homo sapiens (Human)
Description:n/a
Residue:400
BDBM50408403
NameBDBM50408403
Synonyms:CHEMBL169753
TypeSmall organic molecule
Emp. Form.C26H27BrF3N3O2
Mol. Mass.550.411
SMILESCCOc1c(cc(Br)c2ccccc12)C(=O)NCCN1CCN(CC1)c1cccc(c1)C(F)(F)F