Reaction Details
TargetD(3) dopamine receptor
LigandBDBM50287175
Substrate/Competitorn/a
Meas. Tech.ChEMBL_62439 (CHEMBL858764)
Ki 39.81±n/a nM
Citation Nilsson, JWikström, HSmilde, AGlase, SPugsley, TCruciani, GPastor, MClementi, S GRID/GOLPE 3D quantitative structure-activity relationship study on a set of benzamides and naphthamides, with affinity for the dopamine D3 receptor subtype. J Med Chem40:833-40 (1997) 
 
D(3) dopamine receptor
Name:D(3) dopamine receptor
Type:n/a
Mol. Mass.:44243.43
Organism:Homo sapiens (Human)
Description:n/a
Residue:400
BDBM50287175
NameBDBM50287175
Synonyms:4-Bromo-1-methoxy-naphthalene-2-carboxylic acid {2-[4-(3-chloro-phenyl)-piperazin-1-yl]-ethyl}-amide | CHEMBL442535
TypeSmall organic molecule
Emp. Form.C24H25BrClN3O2
Mol. Mass.502.831
SMILESCOc1c(cc(Br)c2ccccc12)C(=O)NCCN1CCN(CC1)c1cccc(Cl)c1