Reaction Details
TargetMuscarinic acetylcholine receptor M3
LigandBDBM50408540
Substrate/Competitorn/a
Meas. Tech.ChEMBL_138975 (CHEMBL857564)
Ki 158±n/a nM
Citation Bolognesi, MLMinarini, ABudriesi, RCacciaguerra, SChiarini, ASpampinato, STumiatti, VMelchiorre, C Universal template approach to drug design: polyamines as selective muscarinic receptor antagonists. J Med Chem41:4150-60 (1998) 
 
Muscarinic acetylcholine receptor M3
Name:Muscarinic acetylcholine receptor M3
Type:Enzyme Catalytic Domain
Mol. Mass.:66086.66
Organism:RAT
Description:Cholinergic, muscarinic M3 CHRM3 RAT::P08483
Residue:589
BDBM50408540
NameBDBM50408540
Synonyms:CHEMBL335115
TypeSmall organic molecule
Emp. Form.C36H55N7O4
Mol. Mass.649.8664
SMILESCN(CCCCCCCCN(C)C(=O)CCCCCNCC(=O)N1c2ccccc2C(=O)Nc2cccnc12)C(=O)CCCCCN