Reaction Details
TargetMuscarinic acetylcholine receptor M3
LigandBDBM50408529
Substrate/Competitorn/a
Meas. Tech.ChEMBL_138975 (CHEMBL857564)
Ki 2570±n/a nM
Citation Bolognesi, MLMinarini, ABudriesi, RCacciaguerra, SChiarini, ASpampinato, STumiatti, VMelchiorre, C Universal template approach to drug design: polyamines as selective muscarinic receptor antagonists. J Med Chem41:4150-60 (1998) 
 
Muscarinic acetylcholine receptor M3
Name:Muscarinic acetylcholine receptor M3
Type:Enzyme Catalytic Domain
Mol. Mass.:66086.66
Organism:RAT
Description:Cholinergic, muscarinic M3 CHRM3 RAT::P08483
Residue:589
BDBM50408529
NameBDBM50408529
Synonyms:CHEMBL1202001
TypeSmall organic molecule
Emp. Form.C50H68N10O4
Mol. Mass.873.1395
SMILESCN(CCCCCCCCN(C)CCCCCCNCC(=O)N1c2ccccc2NC(=O)c2cccnc12)CCCCCCNCC(=O)N1c2ccccc2NC(=O)c2cccnc12