Reaction Details
TargetMuscarinic acetylcholine receptor M1
LigandBDBM50408529
Substrate/Competitorn/a
Meas. Tech.ChEMBL_139096 (CHEMBL744272)
Ki 14±n/a nM
Citation Bolognesi, MLMinarini, ABudriesi, RCacciaguerra, SChiarini, ASpampinato, STumiatti, VMelchiorre, C Universal template approach to drug design: polyamines as selective muscarinic receptor antagonists. J Med Chem41:4150-60 (1998) 
 
Muscarinic acetylcholine receptor M1
Name:Muscarinic acetylcholine receptor M1
Type:Enzyme Catalytic Domain
Mol. Mass.:51390.46
Organism:RAT
Description:P08482
Residue:460
BDBM50408529
NameBDBM50408529
Synonyms:CHEMBL1202001
TypeSmall organic molecule
Emp. Form.C50H68N10O4
Mol. Mass.873.1395
SMILESCN(CCCCCCCCN(C)CCCCCCNCC(=O)N1c2ccccc2NC(=O)c2cccnc12)CCCCCCNCC(=O)N1c2ccccc2NC(=O)c2cccnc12