Reaction Details
TargetMuscarinic acetylcholine receptor M4
LigandBDBM50407222
Substrate/Competitorn/a
Meas. Tech.ChEMBL_139256 (CHEMBL745529)
Ki 16±n/a nM
Citation Bolognesi, MLMinarini, ABudriesi, RCacciaguerra, SChiarini, ASpampinato, STumiatti, VMelchiorre, C Universal template approach to drug design: polyamines as selective muscarinic receptor antagonists. J Med Chem41:4150-60 (1998) 
 
Muscarinic acetylcholine receptor M4
Name:Muscarinic acetylcholine receptor M4
Type:Enzyme Catalytic Domain
Mol. Mass.:52841.70
Organism:RAT
Description:Cholinergic, muscarinic M4 CHRM4 RAT::P08485
Residue:477
BDBM50407222
NameBDBM50407222
Synonyms:CHEMBL112244
TypeSmall organic molecule
Emp. Form.C36H59N7O2
Mol. Mass.621.8994
SMILESCN(CCCCCCN)CCCCCCCCN(C)CCCCCCNCC(=O)N1c2ccccc2C(=O)Nc2cccnc12