Reaction Details
TargetTranslocator protein
LigandBDBM50408734
Substrate/Competitorn/a
Meas. Tech.ChEMBL_37806 (CHEMBL651181)
IC50 1.41±n/a nM
Citation Trapani, GFranco, MLatrofa, ARicciardi, LCarotti, ASerra, MSanna, EBiggio, GLiso, G Novel 2-phenylimidazo[1,2-a]pyridine derivatives as potent and selective ligands for peripheral benzodiazepine receptors: synthesis, binding affinity, and in vivo studies. J Med Chem42:3934-41 (1999) Translocator protein
Name:Translocator protein
Type:Mitochondrion membrane protein
Mol. Mass.:18945.84
Organism:Rattus norvegicus (rat)
Description:Competitive binding experiments were performed on rat kidney mitochondrial membranes.
Residue:169
BDBM50408734
NameBDBM50408734
Synonyms:CHEMBL126262
TypeSmall organic molecule
Emp. Form.C22H26ClN3O
Mol. Mass.383.914
SMILESCCCN(CCC)C(=O)Cc1c(nc2c(C)cccn12)-c1ccc(Cl)cc1