Reaction Details
TargetTranslocator protein
LigandBDBM50060126
Substrate/Competitorn/a
Meas. Tech.ChEMBL_37807 (CHEMBL651182)
IC50 1.58±n/a nM
Citation Trapani, GFranco, MLatrofa, ARicciardi, LCarotti, ASerra, MSanna, EBiggio, GLiso, G Novel 2-phenylimidazo[1,2-a]pyridine derivatives as potent and selective ligands for peripheral benzodiazepine receptors: synthesis, binding affinity, and in vivo studies. J Med Chem42:3934-41 (1999) Translocator protein
Name:Translocator protein
Type:Mitochondrion membrane protein
Mol. Mass.:18945.84
Organism:Rattus norvegicus (rat)
Description:Competitive binding experiments were performed on rat kidney mitochondrial membranes.
Residue:169
BDBM50060126
NameBDBM50060126
Synonyms:2-[6,8-Dibromo-2-(4-chloro-phenyl)-imidazo[1,2-a]pyridin-3-yl]-N,N-dipropyl-acetamide | CHEMBL450283
TypeSmall organic molecule
Emp. Form.C21H22Br2ClN3O
Mol. Mass.527.68
SMILESCCCN(CCC)C(=O)Cc1c(nc2c(Br)cc(Br)cn12)-c1ccc(Cl)cc1