Reaction Details
TargetHistidine-rich protein PFHRP-II
LigandBDBM22985
Substrate/Competitorn/a
Meas. Tech.ChEMBL_155111 (CHEMBL763685)
IC50 15000±n/a nM
Citation Vippagunta, SRDorn, AMatile, HBhattacharjee, AKKarle, JMEllis, WYRidley, RGVennerstrom, JL Structural specificity of chloroquine-hematin binding related to inhibition of hematin polymerization and parasite growth. J Med Chem42:4630-9 (1999) Histidine-rich protein PFHRP-II
Name:Histidine-rich protein PFHRP-II
Type:PROTEIN
Mol. Mass.:35156.49
Organism:Plasmodium falciparum
Description:ChEMBL_500704
Residue:332
BDBM22985
NameBDBM22985
Synonyms:Aralen CHLOROQUINE PHOSPHATE Chloroquine med.21724, Compound 8 | {4-[(7-chloroquinolin-4-yl)amino]pentyl}diethylamine
TypeAntimalarial
Emp. Form.C18H26ClN3
Mol. Mass.319.872
SMILESCCN(CC)CCCC(C)Nc1ccnc2cc(Cl)ccc12