Reaction Details
TargetVascular endothelial growth factor receptor 2
LigandBDBM50408949
Substrate/Competitorn/a
Meas. Tech.ChEMBL_213948 (CHEMBL811926)
IC50 182±n/a nM
Citation Vieth, MCummins, DJ DoMCoSAR: a novel approach for establishing the docking mode that is consistent with the structure-activity relationship. Application to HIV-1 protease inhibitors and VEGF receptor tyrosine kinase inhibitors. J Med Chem43:3020-32 (2000) Vascular endothelial growth factor receptor 2
Name:Vascular endothelial growth factor receptor 2
Type:PROTEIN
Mol. Mass.:152506.58
Organism:Mus musculus
Description:ChEMBL_1469997
Residue:1367
BDBM50408949
NameBDBM50408949
Synonyms:CHEMBL323523
TypeSmall organic molecule
Emp. Form.C17H16N2O3
Mol. Mass.296.3205
SMILESCCOC(=O)c1c[nH]c(\C=C2\C(=O)Nc3ccccc23)c1C