Reaction Details
TargetVascular endothelial growth factor receptor 2
LigandBDBM50408947
Substrate/Competitorn/a
Meas. Tech.ChEMBL_213948 (CHEMBL811926)
IC50 71±n/a nM
Citation Vieth, MCummins, DJ DoMCoSAR: a novel approach for establishing the docking mode that is consistent with the structure-activity relationship. Application to HIV-1 protease inhibitors and VEGF receptor tyrosine kinase inhibitors. J Med Chem43:3020-32 (2000) Vascular endothelial growth factor receptor 2
Name:Vascular endothelial growth factor receptor 2
Type:PROTEIN
Mol. Mass.:152506.58
Organism:Mus musculus
Description:ChEMBL_1469997
Residue:1367
BDBM50408947
NameBDBM50408947
Synonyms:CHEMBL103211
TypeSmall organic molecule
Emp. Form.C18H18N2O3
Mol. Mass.310.3471
SMILESCCOC(=O)c1c(C)[nH]c(\C=C2\C(=O)Nc3ccccc23)c1C