Reaction Details
TargetGag-Pol polyprotein [489-587]
LigandBDBM50035629
Substrate/Competitorn/a
Meas. Tech.ChEMBL_158030 (CHEMBL768621)
IC50 212±n/a nM
Citation Vieth, MCummins, DJ DoMCoSAR: a novel approach for establishing the docking mode that is consistent with the structure-activity relationship. Application to HIV-1 protease inhibitors and VEGF receptor tyrosine kinase inhibitors. J Med Chem43:3020-32 (2000) Gag-Pol polyprotein [489-587]
Name:Gag-Pol polyprotein [489-587]
Type:Enzyme Subunit
Mol. Mass.:10781.16
Organism:Human immunodeficiency virus type 1
Description:P04585[489-587]
Residue:99
BDBM50035629
NameBDBM50035629
Synonyms:CHEMBL105299 [1-Benzyl-2-hydroxy-4-(2-hydroxy-1-methyl-indan-1-ylcarbamoyl)-5-phenyl-pentyl]-carbamic acid tert-butyl ester
TypeSmall organic molecule
Emp. Form.C34H42N2O5
Mol. Mass.558.7077
SMILESCC(C)(C)OC(=O)N[C@@H](Cc1ccccc1)[C@@H](O)C[C@@H](Cc1ccccc1)C(=O)N[C@]1(C)[C@H](O)Cc2ccccc12