Reaction Details
TargetVascular endothelial growth factor receptor 2
LigandBDBM50065312
Substrate/Competitorn/a
Meas. Tech.ChEMBL_213948 (CHEMBL811926)
IC50 2089±n/a nM
Citation Vieth, MCummins, DJ DoMCoSAR: a novel approach for establishing the docking mode that is consistent with the structure-activity relationship. Application to HIV-1 protease inhibitors and VEGF receptor tyrosine kinase inhibitors. J Med Chem43:3020-32 (2000) Vascular endothelial growth factor receptor 2
Name:Vascular endothelial growth factor receptor 2
Type:PROTEIN
Mol. Mass.:152506.58
Organism:Mus musculus
Description:ChEMBL_1469997
Residue:1367
BDBM50065312
NameBDBM50065312
Synonyms:(Z)-4-methyl-3-(4-morpholinobenzylidene)indolin-2-one 4-Methyl-3-[1-(4-morpholin-4-yl-phenyl)-meth-(Z)-ylidene]-1,3-dihydro-indol-2-one | CHEMBL90277
TypeSmall organic molecule
Emp. Form.C20H20N2O2
Mol. Mass.320.385
SMILESCc1cccc2NC(=O)\C(=C/c3ccc(cc3)N3CCOCC3)c12