Reaction Details
TargetHLA class I histocompatibility antigen, A alpha chain
LigandBDBM50409345
Substrate/Competitorn/a
Meas. Tech.ChEMBL_47858 (CHEMBL660105)
IC50 11.51±n/a nM
Citation Doytchinova, IAFlower, DR Toward the quantitative prediction of T-cell epitopes: coMFA and coMSIA studies of peptides with affinity for the class I MHC molecule HLA-A*0201. J Med Chem44:3572-81 (2001) HLA class I histocompatibility antigen, A alpha chain
Name:HLA class I histocompatibility antigen, A alpha chain
Type:PROTEIN
Mol. Mass.:40836.72
Organism:Homo sapiens (Human)
Description:ChEMBL_47858
Residue:365
BDBM50409345
NameBDBM50409345
Synonyms:CHEMBL263173
TypeSmall organic molecule
Emp. Form.C53H75N11O14
Mol. Mass.1090.2279
SMILESCC(C)C[C@H](NC(=O)[C@@H](N)Cc1c[nH]c2ccccc12)C(=O)N[C@@H](CC(O)=O)C(=O)N[C@@H](CCC(N)=O)C(=O)N[C@@H](C(C)C)C(=O)N1CCC[C@H]1C(=O)N[C@@H](Cc1ccccc1)C(=O)N[C@@H](CO)C(=O)N[C@@H](C(C)C)C(O)=O