Reaction Details
TargetBeta-2 adrenergic receptor
LigandBDBM50409468
Substrate/Competitorn/a
Meas. Tech.ChEMBL_218263 (CHEMBL819428)
IC50 3311.31±n/a nM
Citation Tanaka, NTamai, TMukaiyama, HHirabayashi, AMuranaka, HAkahane, SMiyata, HAkahane, M Discovery of novel N-phenylglycine derivatives as potent and selective beta(3)-adrenoceptor agonists for the treatment of frequent urination and urinary incontinence. J Med Chem44:1436-45 (2001) Beta-2 adrenergic receptor
Name:Beta-2 adrenergic receptor
Type:PROTEIN
Mol. Mass.:46896.26
Organism:Rattus norvegicus
Description:ChEMBL_38603
Residue:418
BDBM50409468
NameBDBM50409468
Synonyms:CHEMBL32670
TypeSmall organic molecule
Emp. Form.C19H23ClN2O4
Mol. Mass.378.85
SMILESC[C@H](NCCc1ccc(NCC(O)=O)c(Cl)c1)[C@H](O)c1ccc(O)cc1