Reaction Details
TargetBeta-2 adrenergic receptor
LigandBDBM50409482
Substrate/Competitorn/a
Meas. Tech.ChEMBL_218263 (CHEMBL819428)
IC50 10964.78±n/a nM
Citation Tanaka, NTamai, TMukaiyama, HHirabayashi, AMuranaka, HAkahane, SMiyata, HAkahane, M Discovery of novel N-phenylglycine derivatives as potent and selective beta(3)-adrenoceptor agonists for the treatment of frequent urination and urinary incontinence. J Med Chem44:1436-45 (2001) Beta-2 adrenergic receptor
Name:Beta-2 adrenergic receptor
Type:PROTEIN
Mol. Mass.:46896.26
Organism:Rattus norvegicus
Description:ChEMBL_38603
Residue:418
BDBM50409482
NameBDBM50409482
Synonyms:CHEMBL35459
TypeSmall organic molecule
Emp. Form.C21H28N2O4
Mol. Mass.372.458
SMILESC[C@H](NCCc1ccc(NC(C)(C)C(O)=O)cc1)[C@H](O)c1ccc(O)cc1