Reaction Details
TargetReverse transcriptase/RNaseH
LigandBDBM50409561
Substrate/Competitorn/a
Meas. Tech.ChEMBL_78585 (CHEMBL686036)
EC50>2000±n/a nM
Citation Lobatón, ERodríguez-Barrios, FGago, FPérez-Pérez, MJDe Clercq, EBalzarini, JCamarasa, MJVelázquez, S Synthesis of 3' '-substituted TSAO derivatives with anti-HIV-1 and anti-HIV-2 activity through an efficient palladium-catalyzed cross-coupling approach. J Med Chem45:3934-45 (2002) Reverse transcriptase/RNaseH
Name:Reverse transcriptase/RNaseH
Type:PROTEIN
Mol. Mass.:65229.15
Organism:Human immunodeficiency virus 1
Description:ChEMBL_1473730
Residue:566
BDBM50409561
NameBDBM50409561
Synonyms:CHEMBL265105
TypeSmall organic molecule
Emp. Form.C29H51N5O10SSi2
Mol. Mass.717.979
SMILESCc1cn(C2OC(CO[Si](C)(C)C(C)(C)C)C3(OS(=O)(=O)C(CC(N)=O)=C3NCC(N)=O)C2O[Si](C)(C)C(C)(C)C)c(=O)n(C)c1=O