Reaction Details
TargetReverse transcriptase/RNaseH
LigandBDBM50409570
Substrate/Competitorn/a
Meas. Tech.ChEMBL_78584 (CHEMBL686035)
EC50 3500±n/a nM
Citation Lobatón, ERodríguez-Barrios, FGago, FPérez-Pérez, MJDe Clercq, EBalzarini, JCamarasa, MJVelázquez, S Synthesis of 3' '-substituted TSAO derivatives with anti-HIV-1 and anti-HIV-2 activity through an efficient palladium-catalyzed cross-coupling approach. J Med Chem45:3934-45 (2002) Reverse transcriptase/RNaseH
Name:Reverse transcriptase/RNaseH
Type:PROTEIN
Mol. Mass.:65229.15
Organism:Human immunodeficiency virus 1
Description:ChEMBL_1473730
Residue:566
BDBM50409570
NameBDBM50409570
Synonyms:CHEMBL128354
TypeSmall organic molecule
Emp. Form.C29H49N3O10SSi2
Mol. Mass.687.949
SMILESCCOC(=O)CC=C1C(=N)C2(OS1(=O)=O)C(CO[Si](C)(C)C(C)(C)C)OC(C2O[Si](C)(C)C(C)(C)C)n1cc(C)c(=O)[nH]c1=O